BDBM50258589 (S)-6-(2-(1H-pyrazol-1-yl)phenyl)-6,7-dihydro-5H-pyrrolo[1,2-a]imidazole::CHEMBL448908
SMILES C1[C@H](Cn2ccnc12)c1ccccc1-n1cccn1
InChI Key InChIKey=IPPGENORPYHMGX-GFCCVEGCSA-N
Data  1 KI  3 EC50
  Tab Delimited (TSV)   2D SDfile   Computed 3D by Vconf -m prep SDfile
Find this compound or compounds like it in BindingDB:
Activity Spreadsheet -- Enzyme Inhibition Constant Data from BindingDB
Found 1 hit for monomerid = 50258589
TargetAlpha-1D adrenergic receptor(Homo sapiens (Human))
Pfizer
Curated by ChEMBL
LigandPNGBDBM50258589((S)-6-(2-(1H-pyrazol-1-yl)phenyl)-6,7-dihydro-5H-p...)
Affinity DataEC50: >1.00E+4nM. Assay description: Agonist activity at human adrenergic alpha1D receptor expressed in CHO cells assessed as calcium mobilization by FLIPR
In DepthDetails ArticlePubMed